[Dock-fans] Parallel

Gustavo HMF Souza desouz at fcm.unicamp.br
Fri Oct 20 11:55:48 PDT 2006


Hi all!

 

I have a problem when I am trying to install dock after  ./configure
gnu.parallel. Please see above:

 

korax at sg2gq1:~/bin/dock6/install> make all

Starting installation of DOCK 6.0 alpha at Fri Oct 20 17:42:22 BRST 2006.

 

cd ../src; make install

make[1]: Entering directory `/home/sgi/teste/korax/bin/dock6/src'

cd dock; make install

make[2]: Entering directory `/home/sgi/teste/korax/bin/dock6/src/dock'

g++ -c  -DBUILD_DOCK_WITH_MPI -DMPICH_IGNORE_CXX_SEEK -I/include -O2 -o
amber_typer.o  amber_typer.cpp

In file included from /usr/include/mpi.h:1081,

                 from dock.h:28,

                 from amber_typer.cpp:1:

/usr/include/mpi++.h:1473: error: syntax error before numeric constant

make[2]: *** [amber_typer.o] Error 1

make[2]: Leaving directory `/home/sgi/teste/korax/bin/dock6/src/dock'

make[1]: *** [install] Error 2

make[1]: Leaving directory `/home/sgi/teste/korax/bin/dock6/src'

make: *** [install] Error 2

 

How can I fix this?

 

Cheers,

Gustavo.

-------------- next part --------------
An HTML attachment was scrubbed...
URL: http://blur.compbio.ucsf.edu/pipermail/dock-fans/attachments/20061020/66ec52be/attachment.html


More information about the Dock-fans mailing list