[Dock-fans] in the installation of dock..

lsayaved at lcg.unam.mx lsayaved at lcg.unam.mx
Thu Nov 8 06:55:31 PST 2007


When Im installing dock6 I have the following error, does any body have
the fearest idea of how to correct it??

$make all
Starting installation of
DOCK v6.1
at Thu Nov  8 08:47:02 CST 2007.

cd ../src && make install
cd dock && make install
g++ -c  -O2 -o amber_typer.o  amber_typer.cpp
amber_typer.cpp: In function 'char* white_line(char*)':
amber_typer.cpp:11: error: 'strlen' was not declared in this scope
amber_typer.cpp: In function 'int assign_node(ATOM_TYPE_NODE&, int)':
amber_typer.cpp:62: error: 'strtok' was not declared in this scope
amber_typer.cpp:62: error: 'strcpy' was not declared in this scope
amber_typer.cpp:83: error: 'strncmp' was not declared in this scope
amber_typer.cpp: In function 'int check_type(const char*, const char*)':
amber_typer.cpp:121: error: 'strstr' was not declared in this scope
amber_typer.cpp: In member function 'void
ATOM_TYPER::get_vdw_labels(std::string, bool)':
amber_typer.cpp:281: error: 'strncmp' was not declared in this scope
amber_typer.cpp:342: error: 'strtok' was not declared in this scope
amber_typer.cpp: In member function 'int
ATOM_TYPER::assign_vdw_labels(DOCKMol&, int)':
amber_typer.cpp:471: error: 'strcmp' was not declared in this scope
amber_typer.cpp: In member function 'void
BOND_TYPER::get_flex_labels(std::string)':
amber_typer.cpp:527: error: 'strncmp' was not declared in this scope
amber_typer.cpp:540: error: 'strlen' was not declared in this scope
amber_typer.cpp:557: error: 'strtok' was not declared in this scope
amber_typer.cpp: In member function 'void
BOND_TYPER::get_flex_search(std::string)':
amber_typer.cpp:594: error: 'strtok' was not declared in this scope
amber_typer.cpp:596: error: 'strcmp' was not declared in this scope
amber_typer.cpp: In member function 'void
CHEM_TYPER::get_chem_labels(std::string)':
amber_typer.cpp:749: error: 'strncmp' was not declared in this scope
amber_typer.cpp:758: error: 'strtok' was not declared in this scope
make[2]: *** [amber_typer.o] Error 1
make[1]: *** [dock6] Error 2
make: *** [install] Error 2



More information about the Dock-fans mailing list