[Dock-fans] Installation problem

Scott Brozell sbrozell at rci.rutgers.edu
Thu Jul 5 13:48:40 PDT 2018


Hi,

This is likely due to an old GNU compiler; what version do you have ?

A good recommendation is to check the list archives:
cut-n-paste part of the error message into the dock-fans search bar at
http://dock.compbio.ucsf.edu/DOCK_6/index.htm#searchdockfans

Here 'error: no matching constructor for' yields:
http://mailman.docking.org/pipermail/dock-fans/2018-January/003360.html

scott

On Thu, Jun 28, 2018 at 03:54:30PM +0200, ctetsass wrote:
> I am working on Mac OX ( High Sierra).
> 
> I followed all the instructions for the installation, and unfortunately i always got some error massage at this step
> 
> make all
> Starting installation of 
> DOCK v6.8
> at Thu Jun 28 15:44:24 CEST 2018.
> 
> cd ../src && make install
> :
> :
> :
> 
> ./tnt/tnt_sparse_matrix_csr.h:98:3: error: no matching constructor for
>       initialization of 'Array1D<int>'
>                 rowptr_(M, r), colind_(nz, c), dim1_(M), dim2_(N) {}
> 
> 
> :
> :
> :
> 
> ./tnt/tnt_sparse_matrix_csr.h:98:18: error: no matching constructor for
>       initialization of 'Array1D<int>'
>                 rowptr_(M, r), colind_(nz, c), dim1_(M), dim2_(N) {}
> :
> :
> :
> 
> 2 warnings and 2 errors generated.
> make[2]: *** [score_chemgrid.o] Error 1
> make[1]: *** [dock6] Error 2
> make: *** [install] Error 2


More information about the Dock-fans mailing list